[Bug 4208] New: uClibc-0.9.29 fails to build

bugzilla-daemon at amethyst.openembedded.net bugzilla-daemon at amethyst.openembedded.net
Thu May 1 10:23:08 UTC 2008


http://bugs.openembedded.net/show_bug.cgi?id=4208

           Summary: uClibc-0.9.29 fails to build                           
    Classification: Unclassified                                           
           Product: Openembedded                                           
           Version: Angstrom unstable                                      
          Platform: Other                                                  
        OS/Version: other                                                  
            Status: UNCONFIRMED                                            
          Severity: minor                                                  
          Priority: P3                                                     
         Component: Build                                                  
        AssignedTo: openembedded-issues at lists.openembedded.org             
        ReportedBy: cliff.brake at gmail.com                                  


machine: cm-x270
host: AMD64
2008-04-30 OE dev snapshot

|   CC libc/misc/error/err.os
|   CC libc/misc/file/lockf.os
|   CC libc/misc/file/lockf64.os
|   CC libc/misc/fnmatch/fnmatch.os
|   CC libc/misc/ftw/ftw.os
|   CC libc/misc/ftw/ftw64.os
|   CC libc/misc/glob/glob-susv3.os
|   CC libc/misc/glob/glob64-susv3.os
|   CC libc/misc/gnu/obstack.os
|   CC libc/misc/internals/tempname.os
|   CC libc/misc/internals/errno.os
|   CC libc/misc/internals/__errno_location.os
|   CC libc/misc/internals/__h_errno_location.os
|   CC libc/misc/locale/setlocale.os
|   CC libc/misc/locale/localeconv.os
|   CC libc/misc/locale/_locale_init.os
|   CC libc/misc/locale/nl_langinfo.os
|   CC libc/misc/mntent/mntent.os
|   CC libc/misc/regex/regex.os
| In file included from libc/misc/regex/regex.c:142:
| libc/misc/regex/regex_internal.c:265: error: conflicting types for
'build_wcs_upper_buffer'
| libc/misc/regex/regex_internal.h:389: error: previous declaration of
'build_wcs_upper_buffer' was here
| make[2]: *** [libc/misc/regex/regex.os] Error 1
| make[1]: *** [lib/libc.so.0] Error 2
| make[1]: Leaving directory
`/build/rep3/oe/build/angstrom-2008.1/tmp/work/cm-x270-angstrom-linux-uclibcgnueabi/uclibc-0.9.29-r14/uClibc-0.9.29'
| FATAL: oe_runmake failed
NOTE: Task failed:
/build/rep3/oe/build/angstrom-2008.1/tmp/work/cm-x270-angstrom-linux-uclibcgnueabi/uclibc-0.9.29-r14/temp/log.do_compile.15856
NOTE: package uclibc-0.9.29-r14: task do_compile: failed
ERROR: TaskFailed event exception, aborting
NOTE: package uclibc-0.9.29: failed
ERROR: Build of
/build/rep3/oe/oe/org.openembedded.dev/packages/uclibc/uclibc_0.9.29.bb
do_compile failed
ERROR: Task 107
(/build/rep3/oe/oe/org.openembedded.dev/packages/uclibc/uclibc_0.9.29.bb,
do_compile) failed
NOTE: Tasks Summary: Attempted 220 tasks of which 184 didn't need to be rerun
and 1 failed.
ERROR:
'/build/rep3/oe/oe/org.openembedded.dev/packages/uclibc/uclibc_0.9.29.bb'
failed

-- 
Configure bugmail: http://bugs.openembedded.net/userprefs.cgi?tab=email
------- You are receiving this mail because: -------
You are the assignee for the bug.




More information about the Openembedded-issues mailing list